Target
Tyrosine-protein kinase BTK
Ligand
BDBM472728
Substrate
Meas. Tech.
Inhibitory Activity Assay
IC50
110±n/a nM
Citation
 Zhang, ADing, JXie, HSong, ZXue, YTong, LGeng, M Pyrimido[5,4-B]indolizine or pyrimido[5,4-B]pyrrolizine compound, preparation method and use thereof US Patent  US10829491 Publication Date 11/10/2020 
Target
Name:
Tyrosine-protein kinase BTK
Synonyms:
AGMX1 Agammaglobulinaemia tyrosine kinase B cell progenitor kinase BPK BTK_HUMAN Tyrosine Kinase BTK Tyrosine-protein kinase BTK (BTK)
Type:
Enzyme
Mol. Mass.:
76289.95
Organism:
Homo sapiens (Human)
Description:
Q06187
Residue:
659
  
Inhibitor
Name:
BDBM472728
Synonyms:
US10829491, Compound S21
Type:
Small organic molecule
Emp. Form.:
C25H23N5O2
Mol. Mass.:
425.4824
SMILES:
CC1[C@H](Cn2c1c(-c1ccc(Oc3ccccc3)cc1)c1c(N)ncnc21)NC(=O)C=C
: