Target
Mast/stem cell growth factor receptor Kit
Ligand
BDBM472778
Substrate
Meas. Tech.
Biochemical Activity Assay
Kd
17.5±n/a nM
Citation
 Dineen, TA Compositions and methods for treating KIT- and PDGFRA-mediated diseases US Patent  US10829493 Publication Date 11/10/2020 
Target
Name:
Mast/stem cell growth factor receptor Kit
Synonyms:
CD117 antigen KIT Mast/stem cell growth factor receptor Kit (cKIT) Proto-oncogene tyrosine-protein kinase Kit Stem cell growth factor receptor Tyrosine-protein kinase Kit c-kit v-kit Hardy-Zuckerman 4 feline sarcoma viral oncogene homolog
Type:
Protein
Mol. Mass.:
109869.37
Organism:
Homo sapiens (Human)
Description:
P10721
Residue:
976
  
Inhibitor
Name:
BDBM472778
Synonyms:
US10829493, Example 4
Type:
Small organic molecule
Emp. Form.:
C11H12N6O
Mol. Mass.:
244.2526
SMILES:
Nc1ncnn2cc(cc12)-c1cnn(CCO)c1
: