Target
Lysine-specific histone demethylase 1A
Ligand
BDBM472911
Substrate
Meas. Tech.
LSD1 In Vitro Activity Assay
IC50
1846±78.59 nM
Citation
 Liu, HLi, JWang, JSu, MWang, SZhou, YZhu, WXu, WLi, CJiang, HChen, K Fluorinated cyclopropylamine compound, preparation method therefor, pharmaceutical composition thereof, and uses thereof US Patent  US10836743 Publication Date 11/17/2020 
Target
Name:
Lysine-specific histone demethylase 1A
Synonyms:
AOF2 Flavin-containing amine oxidase domain-containing protein 2 KDM1A KIAA0601 Lysine-specific demethylase 1 (LSD1) Lysine-specific histone demethylase 1 (LSD1)
Type:
Enzyme
Mol. Mass.:
92901.01
Organism:
Homo sapiens (Human)
Description:
O60341
Residue:
852
  
Inhibitor
Name:
BDBM472911
Synonyms:
4-((4-fluoro-4-((((1S,2R)-2-phenyl- cyclopropyl)amino)methyl) piperidin-1-yl)methyl)benzoic acid | US10836743, Compound (1S,2R)-A5
Type:
Small organic molecule
Emp. Form.:
C23H27FN2O2
Mol. Mass.:
382.4711
SMILES:
OC(=O)c1ccc(CN2CCC(F)(CN[C@H]3C[C@@H]3c3ccccc3)CC2)cc1
: