Target
Tyrosine-protein kinase JAK1
Ligand
BDBM472910
Substrate
Meas. Tech.
Biochemical JAK Kinase Assays
Ki
0.063±n/a nM
Citation
 Long, DDSmith, CThompson, C 5 to 7 membered heterocyclic amides as JAK inhibitors US Patent  US10836763 Publication Date 11/17/2020 
Target
Name:
Tyrosine-protein kinase JAK1
Synonyms:
JAK-1 JAK1A JAK1_HUMAN Janus kinase 1 (JAK1) | Janus kinase 1 JAK1
Type:
Protein
Mol. Mass.:
133293.73
Organism:
Homo sapiens (Human)
Description:
P23458
Residue:
1154
  
Inhibitor
Name:
BDBM472910
Synonyms:
US10836763, Example 1 US11713315, Example 1
Type:
Small organic molecule
Emp. Form.:
C31H39N7O3
Mol. Mass.:
557.6865
SMILES:
CCCN1Cc2[nH]c(nc2C[C@H]1C(=O)N1CCN(CCO)CC1)-c1n[nH]c2cc(ccc12)-c1ccc(O)cc1CC
: