Target
Tyrosine-protein kinase JAK3
Ligand
BDBM472910
Substrate
Meas. Tech.
Biochemical JAK Kinase Assays
Ki
0.158±n/a nM
Citation
 Long, DDSmith, CThompson, C 5 to 7 membered heterocyclic amides as JAK inhibitors US Patent  US10836763 Publication Date 11/17/2020 
Target
Name:
Tyrosine-protein kinase JAK3
Synonyms:
JAK-3 JAK3_HUMAN Janus kinase 3 (JAK3) L-JAK | Leukocyte janus kinase
Type:
Protein
Mol. Mass.:
125111.08
Organism:
Homo sapiens (Human)
Description:
P52333
Residue:
1124
  
Inhibitor
Name:
BDBM472910
Synonyms:
US10836763, Example 1 US11713315, Example 1
Type:
Small organic molecule
Emp. Form.:
C31H39N7O3
Mol. Mass.:
557.6865
SMILES:
CCCN1Cc2[nH]c(nc2C[C@H]1C(=O)N1CCN(CCO)CC1)-c1n[nH]c2cc(ccc12)-c1ccc(O)cc1CC
: