Target
Non-receptor tyrosine-protein kinase TYK2
Ligand
BDBM350093
Substrate
Meas. Tech.
Biochemical JAK Kinase Assays
Ki
0.794±n/a nM
Citation
 Long, DDSmith, CThompson, C 5 to 7 membered heterocyclic amides as JAK inhibitors US Patent  US10836763 Publication Date 11/17/2020 
Target
Name:
Non-receptor tyrosine-protein kinase TYK2
Synonyms:
Non-receptor tyrosine-protein kinase TYK2 (TYK2) TYK2_HUMAN | Tyrosine-protein kinase TYK2
Type:
Protein
Mol. Mass.:
133666.03
Organism:
Homo sapiens (Human)
Description:
P29597
Residue:
1187
  
Inhibitor
Name:
BDBM350093
Synonyms:
(S)-(2-(6-(2-ethyl-5-fluoro-4-hydroxyphenyl)-1H-indazol-3-yl)-5-propyl-4,5,6,7-tetrahydro-3H-imidazo[4,5-c]pyridin-6-yl)(4-(2-hydroxyethyl)piperazin-1-yl)methanone US10519153, Example 7 US11254669, Example 7 | US11713315, Example C-1
Type:
Small organic molecule
Emp. Form.:
C31H38FN7O3
Mol. Mass.:
575.6769
SMILES:
CCCN1Cc2[nH]c(nc2C[C@H]1C(=O)N1CCN(CCO)CC1)-c1n[nH]c2cc(ccc12)-c1cc(F)c(O)cc1CC
: