Target
Tyrosine-protein kinase JAK3
Ligand
BDBM472917
Substrate
Meas. Tech.
Biochemical JAK Kinase Assays
Ki
0.200±n/a nM
Citation
 Long, DDSmith, CThompson, C 5 to 7 membered heterocyclic amides as JAK inhibitors US Patent  US10836763 Publication Date 11/17/2020 
Target
Name:
Tyrosine-protein kinase JAK3
Synonyms:
JAK-3 JAK3_HUMAN Janus kinase 3 (JAK3) L-JAK | Leukocyte janus kinase
Type:
Protein
Mol. Mass.:
125111.08
Organism:
Homo sapiens (Human)
Description:
P52333
Residue:
1124
  
Inhibitor
Name:
BDBM472917
Synonyms:
US10836763, Example C-3 US11667637, Example 2-15 | US11713315, Example C-3
Type:
Small organic molecule
Emp. Form.:
C29H34FN7O2
Mol. Mass.:
531.6244
SMILES:
CCc1cc(O)c(F)cc1-c1ccc2c(n[nH]c2c1)-c1nc2C[C@H](N(C)Cc2[nH]1)C(=O)N1CCN(C)C[C@@H]1C
: