Target
Non-receptor tyrosine-protein kinase TYK2
Ligand
BDBM350091
Substrate
Meas. Tech.
Biochemical JAK Kinase Assays
Ki
0.501±n/a nM
Citation
 Long, DDSmith, CThompson, C 5 to 7 membered heterocyclic amides as JAK inhibitors US Patent  US10836763 Publication Date 11/17/2020 
Target
Name:
Non-receptor tyrosine-protein kinase TYK2
Synonyms:
Non-receptor tyrosine-protein kinase TYK2 (TYK2) TYK2_HUMAN | Tyrosine-protein kinase TYK2
Type:
Protein
Mol. Mass.:
133666.03
Organism:
Homo sapiens (Human)
Description:
P29597
Residue:
1187
  
Inhibitor
Name:
BDBM350091
Synonyms:
(S)-(2-(6-(2-ethyl-5-fluoro-4-hydroxyphenyl)-1H-indazol-3-yl)-5-isopropyl-4,5,6,7-tetrahydro-3H-imidazo[4,5-c]pyridin-6-yl)(4-methyl-1,4-diazepan-1-yl)methanone US10519153, Example 5 US11254669, Example 5 US11713315, Example C-4
Type:
Small organic molecule
Emp. Form.:
C31H38FN7O2
Mol. Mass.:
559.6775
SMILES:
CCc1cc(O)c(F)cc1-c1ccc2c(n[nH]c2c1)-c1nc2C[C@H](N(Cc2[nH]1)C(C)C)C(=O)N1CCCN(C)CC1
: