Target
Induced myeloid leukemia cell differentiation protein Mcl-1 [172-327]
Ligand
BDBM38066
Substrate
Meas. Tech.
Binding Assay
Ki
<100.0±n/a nM
Citation
 Lee, TPelz, NFBelmar, JBian, ZOlejniczak, ETFesik, SWChauder, BA Substituted benzofuran, benzothiophene and indole Mcl-1 inhibitors US Patent  US10844032 Publication Date 11/24/2020 
Target
Name:
Induced myeloid leukemia cell differentiation protein Mcl-1 [172-327]
Synonyms:
BCL2L3 MCL1 Mcl-1 (aa 172-327) | Mcl-1 (residues 172-327)
Type:
Mol. Mass.:
17768.02
Organism:
Homo sapiens (Human)
Description:
Q07820[172-327]
Residue:
156
  
Inhibitor
Name:
BDBM38066
Synonyms:
4-chloro-3-(3-(4-chloro-3,5-dimethylphenoxy)propyl)-N-(methylsulfonyl)-1H-indole-2-carboxamide US10844032, Example 51
Type:
Small organic molecule
Emp. Form.:
C21H22Cl2N2O4S
Mol. Mass.:
469.381
SMILES:
Cc1cc(OCCCc2c([nH]c3cccc(Cl)c23)C(=O)NS(C)(=O)=O)cc(C)c1Cl
: