Target
Induced myeloid leukemia cell differentiation protein Mcl-1 [172-327]
Ligand
BDBM289083
Substrate
Meas. Tech.
Binding Assay
Ki
<100.0±n/a nM
Citation
 Lee, TPelz, NFBelmar, JBian, ZOlejniczak, ETFesik, SWChauder, BA Substituted benzofuran, benzothiophene and indole Mcl-1 inhibitors US Patent  US10844032 Publication Date 11/24/2020 
Target
Name:
Induced myeloid leukemia cell differentiation protein Mcl-1 [172-327]
Synonyms:
BCL2L3 MCL1 Mcl-1 (aa 172-327) | Mcl-1 (residues 172-327)
Type:
Mol. Mass.:
17768.02
Organism:
Homo sapiens (Human)
Description:
Q07820[172-327]
Residue:
156
  
Inhibitor
Name:
BDBM289083
Synonyms:
3-(3-(4-chloro-3,5-dimethylphenoxy)propyl)-7-(1,5-dimethyl-3-((pyridin-3-yloxy)methyl)-1H-pyrazol-4-yl)-1H-indole-2-carboxylic acid US10844032, Example 307
Type:
Small organic molecule
Emp. Form.:
C37H36ClN5O5S
Mol. Mass.:
698.23
SMILES:
Cc1c(c(COc2cccnc2)nn1C)-c1cccc2c(CCCOc3cc(C)c(Cl)c(C)c3)c([nH]c12)C(=O)NS(=O)(=O)c1ccccc1
: