Target
WD repeat-containing protein 5
Ligand
BDBM473410
Substrate
Meas. Tech.
TR-FRET Binding Assay
Ki
<0.100±n/a nM
Citation
 Alvarado, JRStauffer, SRGogliotti, RDHan, CMeyers, KMTian, JMacdonald, JDFesik, SWLee, T WDR5 inhibitors and modulators US Patent  US10844044 Publication Date 11/24/2020 
Target
Name:
WD repeat-containing protein 5
Synonyms:
BIG3 WD repeat-containing protein 5 (WDR5) WDR5 | WDR5_HUMAN
Type:
Protein
Mol. Mass.:
36597.13
Organism:
Homo sapiens (Human)
Description:
P61964
Residue:
334
  
Inhibitor
Name:
BDBM473410
Synonyms:
US10844044, Example 328
Type:
Small organic molecule
Emp. Form.:
C28H27F4N5O2S
Mol. Mass.:
573.605
SMILES:
CCn1cc(c(n1)C(F)(F)F)-c1cc(Cn2ccsc2=N)cc(c1)C(=O)N[C@@H](C1CC1)c1ccc(F)c(OC)c1
: