Target
Vascular endothelial growth factor receptor 2
Ligand
BDBM473675
Substrate
Meas. Tech.
Time-Resolved Fluorescence Transfer (FRET) Assay
IC50
9490±n/a nM
Citation
 Jordan, AMNewton, RWaszkowycz, BSutton, JMHynd, GPaoletta, SFordyce, EA Heterocyclic compounds as RET kinase inhibitors US Patent  US10844067 Publication Date 11/24/2020 
Target
Name:
Vascular endothelial growth factor receptor 2
Synonyms:
CD_antigen=CD309 Fetal liver kinase 1 (FLK-1) KDR Protein-tyrosine kinase receptor Flk-1 VEGFR-2 VEGFR2 Vascular Endothelial Growth Factor Receptor Kinase 2 Vascular endothelial growth factor receptor 2 (KDR) Vascular endothelial growth factor receptor 2 (VEGFR2) Vascular endothelial growth factor receptor-2 (VEGFR-2)
Type:
Receptor Tyrosine Kinase
Mol. Mass.:
151510.97
Organism:
Homo sapiens (Human)
Description:
P35968
Residue:
1356
  
Inhibitor
Name:
BDBM473675
Synonyms:
2-(4-Amino-1-(tert-butyl)-1H-pyrazolo[3,4- d]pyrimidin-3-yl)-3-chloro-1H-indole-6- carbonitrile US11661423, Example 18
Type:
Small organic molecule
Emp. Form.:
C18H16ClN7
Mol. Mass.:
365.82
SMILES:
CC(C)(C)n1nc(-c2[nH]c3cc(ccc3c2Cl)C#N)c2c(N)ncnc12
: