Target
Proto-oncogene tyrosine-protein kinase receptor Ret [V804M]
Ligand
BDBM473675
Substrate
Meas. Tech.
Time-Resolved Fluorescence Transfer (FRET) Assay
IC50
77.5±n/a nM
Citation
 Jordan, AMNewton, RWaszkowycz, BSutton, JMHynd, GPaoletta, SFordyce, EA Heterocyclic compounds as RET kinase inhibitors US Patent  US10844067 Publication Date 11/24/2020 
Target
Name:
Proto-oncogene tyrosine-protein kinase receptor Ret [V804M]
Synonyms:
CDHF12 PTC RET RET51 ret enzyme (v804m)
Type:
Enzyme Catalytic Domain
Mol. Mass.:
124350.36
Organism:
Homo sapiens (Human)
Description:
P07949[V804M]
Residue:
1114
  
Inhibitor
Name:
BDBM473675
Synonyms:
2-(4-Amino-1-(tert-butyl)-1H-pyrazolo[3,4- d]pyrimidin-3-yl)-3-chloro-1H-indole-6- carbonitrile US11661423, Example 18
Type:
Small organic molecule
Emp. Form.:
C18H16ClN7
Mol. Mass.:
365.82
SMILES:
CC(C)(C)n1nc(-c2[nH]c3cc(ccc3c2Cl)C#N)c2c(N)ncnc12
: