Target
Cytochrome P450 11B1, mitochondrial
Ligand
BDBM473903
Substrate
Meas. Tech.
Inhibition of Cortisol Synthesis
IC50
1100000±n/a nM
Citation
 Balestra, MBurke, JChen, ZCogan, DLord, JMarshall, DRMcKibben, BPMeyers, KMZhang, Y Bicyclic imidazole derivatives useful for the treatment of renal diseases, cardiovascular diseases and fibrotic diseases US Patent  US10858342 Publication Date 12/8/2020 
Target
Name:
Cytochrome P450 11B1, mitochondrial
Synonyms:
C11B1_HUMAN CYPXIB1 Cytochrome P450 11B1 Cytochrome P450 11B1, mitochondrial | S11BH
Type:
Enzyme
Mol. Mass.:
57591.44
Organism:
Homo sapiens (Human)
Description:
P15538
Residue:
503
  
Inhibitor
Name:
BDBM473903
Synonyms:
3-(4-Fluoro-phenyl)-6,6- dimethyl-3,5,6,7-tetrahydro- benzoimidazol-4-one | US10858342, Compound C-ABP
Type:
Small organic molecule
Emp. Form.:
C15H15FN2O
Mol. Mass.:
258.2908
SMILES:
CC1(C)Cc2ncn(c2C(=O)C1)-c1ccc(F)cc1
: