Target
Complement factor D
Ligand
BDBM474886
Substrate
Meas. Tech.
Inhibition Assay
IC50
<1000±n/a nM
Citation
 Kotian, PLBabu, YSZhang, WVogeti, LWu, MChintareddy, VRRaman, K Benzopyrazole compounds and analogues thereof US Patent  US10849883 Publication Date 12/1/2020 
Target
Name:
Complement factor D
Synonyms:
Adipsin CFAD_HUMAN DF Properdin factor D
Type:
Protein
Mol. Mass.:
27039.19
Organism:
Homo sapiens (Human)
Description:
P00746
Residue:
253
  
Inhibitor
Name:
BDBM474886
Synonyms:
US10849883, Compound 308e | US11559515, Compound 308e
Type:
Small organic molecule
Emp. Form.:
C27H25ClFN7O3
Mol. Mass.:
549.984
SMILES:
CC(=O)c1cn(CC(=O)N(CC(=O)NCc2cccc(Cl)c2F)C2CC2)c2cnc(Nc3cncnc3)cc12
: