Target
Egl nine homolog 1 [181-417]
Ligand
BDBM475401
Substrate
Meas. Tech.
Enzyme Activity Assay
IC50
25.1±n/a nM
Citation
 Hocutt, FMLeonard, Jr., BEPeltier, HMPhuong, VKRabinowitz, MHRosen, MDTarantino, KTVenkatesan, HZhao, LX Benzoimidazoles as prolyl hydroxylase inhibitors US Patent  US10851083 Publication Date 12/1/2020 
Target
Name:
Egl nine homolog 1 [181-417]
Synonyms:
C1orf12 EGLN1_HUMAN | Egl nine homolog 1 (aa 181-417)
Type:
Enzyme
Mol. Mass.:
26555.51
Organism:
Homo sapiens (Human)
Description:
aa 181-417
Residue:
237
  
Inhibitor
Name:
BDBM475401
Synonyms:
1-{5-[3-(2-Chloro-benzyloxy)-phenyl]-1H-benzoimidazol- US11618744, Example 13
Type:
Small organic molecule
Emp. Form.:
C24H17ClN4O3
Mol. Mass.:
444.87
SMILES:
OC(=O)c1cnn(c1)-c1nc2cc(ccc2[nH]1)-c1cccc(OCc2ccccc2Cl)c1
: