Target
Egl nine homolog 1 [181-417]
Ligand
BDBM475465
Substrate
Meas. Tech.
Enzyme Activity Assay
IC50
158±n/a nM
Citation
 Hocutt, FMLeonard, Jr., BEPeltier, HMPhuong, VKRabinowitz, MHRosen, MDTarantino, KTVenkatesan, HZhao, LX Benzoimidazoles as prolyl hydroxylase inhibitors US Patent  US10851083 Publication Date 12/1/2020 
Target
Name:
Egl nine homolog 1 [181-417]
Synonyms:
C1orf12 EGLN1_HUMAN | Egl nine homolog 1 (aa 181-417)
Type:
Enzyme
Mol. Mass.:
26555.51
Organism:
Homo sapiens (Human)
Description:
aa 181-417
Residue:
237
  
Inhibitor
Name:
BDBM475465
Synonyms:
1-(5-Chloro-6-isopropylsulfanyl-1H-benzoimidazol-2-yl)- US11618744, Example 77
Type:
Small organic molecule
Emp. Form.:
C14H13ClN4O2S
Mol. Mass.:
336.797
SMILES:
CC(C)Sc1cc2[nH]c(nc2cc1Cl)-n1cc(cn1)C(O)=O
: