Target
Egl nine homolog 1 [181-417]
Ligand
BDBM475476
Substrate
Meas. Tech.
Enzyme Activity Assay
IC50
39.8±n/a nM
Citation
 Hocutt, FMLeonard, Jr., BEPeltier, HMPhuong, VKRabinowitz, MHRosen, MDTarantino, KTVenkatesan, HZhao, LX Benzoimidazoles as prolyl hydroxylase inhibitors US Patent  US10851083 Publication Date 12/1/2020 
Target
Name:
Egl nine homolog 1 [181-417]
Synonyms:
C1orf12 EGLN1_HUMAN | Egl nine homolog 1 (aa 181-417)
Type:
Enzyme
Mol. Mass.:
26555.51
Organism:
Homo sapiens (Human)
Description:
aa 181-417
Residue:
237
  
Inhibitor
Name:
BDBM475476
Synonyms:
1-[6-Chloro-5-(3-methoxy-benzenesulfonyl)-1H- US11618744, Example 88
Type:
Small organic molecule
Emp. Form.:
C18H13ClN4O5S
Mol. Mass.:
432.838
SMILES:
COc1cccc(c1)S(=O)(=O)c1cc2nc([nH]c2cc1Cl)-n1cc(cn1)C(O)=O
: