Target
Egl nine homolog 1 [181-417]
Ligand
BDBM475481
Substrate
Meas. Tech.
Enzyme Activity Assay
IC50
31.6±n/a nM
Citation
 Hocutt, FMLeonard, Jr., BEPeltier, HMPhuong, VKRabinowitz, MHRosen, MDTarantino, KTVenkatesan, HZhao, LX Benzoimidazoles as prolyl hydroxylase inhibitors US Patent  US10851083 Publication Date 12/1/2020 
Target
Name:
Egl nine homolog 1 [181-417]
Synonyms:
C1orf12 EGLN1_HUMAN | Egl nine homolog 1 (aa 181-417)
Type:
Enzyme
Mol. Mass.:
26555.51
Organism:
Homo sapiens (Human)
Description:
aa 181-417
Residue:
237
  
Inhibitor
Name:
BDBM475481
Synonyms:
1-[6-Chloro-5-(2-chloro-phenylmethanesulfonyl)-1H- US11618744, Example 93
Type:
Small organic molecule
Emp. Form.:
C18H12Cl2N4O4S
Mol. Mass.:
451.283
SMILES:
OC(=O)c1cnn(c1)-c1nc2cc(c(Cl)cc2[nH]1)S(=O)(=O)Cc1ccccc1Cl
: