Target
Egl nine homolog 1 [181-417]
Ligand
BDBM475494
Substrate
Meas. Tech.
Enzyme Activity Assay
IC50
31.6±n/a nM
Citation
 Hocutt, FMLeonard, Jr., BEPeltier, HMPhuong, VKRabinowitz, MHRosen, MDTarantino, KTVenkatesan, HZhao, LX Benzoimidazoles as prolyl hydroxylase inhibitors US Patent  US10851083 Publication Date 12/1/2020 
Target
Name:
Egl nine homolog 1 [181-417]
Synonyms:
C1orf12 EGLN1_HUMAN | Egl nine homolog 1 (aa 181-417)
Type:
Enzyme
Mol. Mass.:
26555.51
Organism:
Homo sapiens (Human)
Description:
aa 181-417
Residue:
237
  
Inhibitor
Name:
BDBM475494
Synonyms:
1-[6-(Propane-1-sulfonyl)-5-trifluoromethoxy-1H- US11618744, Example 106
Type:
Small organic molecule
Emp. Form.:
C15H13F3N4O5S
Mol. Mass.:
418.348
SMILES:
CCCS(=O)(=O)c1cc2[nH]c(nc2cc1OC(F)(F)F)-n1cc(cn1)C(O)=O
: