Target
Egl nine homolog 1 [181-417]
Ligand
BDBM475542
Substrate
Meas. Tech.
Enzyme Activity Assay
IC50
25.1±n/a nM
Citation
 Hocutt, FMLeonard, Jr., BEPeltier, HMPhuong, VKRabinowitz, MHRosen, MDTarantino, KTVenkatesan, HZhao, LX Benzoimidazoles as prolyl hydroxylase inhibitors US Patent  US10851083 Publication Date 12/1/2020 
Target
Name:
Egl nine homolog 1 [181-417]
Synonyms:
C1orf12 EGLN1_HUMAN | Egl nine homolog 1 (aa 181-417)
Type:
Enzyme
Mol. Mass.:
26555.51
Organism:
Homo sapiens (Human)
Description:
aa 181-417
Residue:
237
  
Inhibitor
Name:
BDBM475542
Synonyms:
1-(5-Ethylsulfonyl-6-trifluoromethyl-1H-benzoimidazol-2- US11618744, Example 154
Type:
Small organic molecule
Emp. Form.:
C14H11F3N4O4S
Mol. Mass.:
388.322
SMILES:
CCS(=O)(=O)c1cc2nc([nH]c2cc1C(F)(F)F)-n1cc(cn1)C(O)=O
: