Target
Egl nine homolog 1 [181-417]
Ligand
BDBM475547
Substrate
Meas. Tech.
Enzyme Activity Assay
IC50
39.8±n/a nM
Citation
 Hocutt, FMLeonard, Jr., BEPeltier, HMPhuong, VKRabinowitz, MHRosen, MDTarantino, KTVenkatesan, HZhao, LX Benzoimidazoles as prolyl hydroxylase inhibitors US Patent  US10851083 Publication Date 12/1/2020 
Target
Name:
Egl nine homolog 1 [181-417]
Synonyms:
C1orf12 EGLN1_HUMAN | Egl nine homolog 1 (aa 181-417)
Type:
Enzyme
Mol. Mass.:
26555.51
Organism:
Homo sapiens (Human)
Description:
aa 181-417
Residue:
237
  
Inhibitor
Name:
BDBM475547
Synonyms:
1-(5-Phenylsulfanyl-6-trifluoromethyl-1H-benzoimidazol- US11618744, Example 159
Type:
Small organic molecule
Emp. Form.:
C18H11F3N4O2S
Mol. Mass.:
404.366
SMILES:
OC(=O)c1cnn(c1)-c1nc2cc(Sc3ccccc3)c(cc2[nH]1)C(F)(F)F
: