Target
Egl nine homolog 1 [181-417]
Ligand
BDBM475548
Substrate
Meas. Tech.
Enzyme Activity Assay
IC50
31.6±n/a nM
Citation
 Hocutt, FMLeonard, Jr., BEPeltier, HMPhuong, VKRabinowitz, MHRosen, MDTarantino, KTVenkatesan, HZhao, LX Benzoimidazoles as prolyl hydroxylase inhibitors US Patent  US10851083 Publication Date 12/1/2020 
Target
Name:
Egl nine homolog 1 [181-417]
Synonyms:
C1orf12 EGLN1_HUMAN | Egl nine homolog 1 (aa 181-417)
Type:
Enzyme
Mol. Mass.:
26555.51
Organism:
Homo sapiens (Human)
Description:
aa 181-417
Residue:
237
  
Inhibitor
Name:
BDBM475548
Synonyms:
1-[5-(4-Methoxy-phenylsulfanyl)-6-trifluoromethyl-1H- US11618744, Example 160
Type:
Small organic molecule
Emp. Form.:
C19H13F3N4O3S
Mol. Mass.:
434.392
SMILES:
COc1ccc(Sc2cc3nc([nH]c3cc2C(F)(F)F)-n2cc(cn2)C(O)=O)cc1
: