Target
Egl nine homolog 1 [181-417]
Ligand
BDBM475550
Substrate
Meas. Tech.
Enzyme Activity Assay
IC50
25.1±n/a nM
Citation
 Hocutt, FMLeonard, Jr., BEPeltier, HMPhuong, VKRabinowitz, MHRosen, MDTarantino, KTVenkatesan, HZhao, LX Benzoimidazoles as prolyl hydroxylase inhibitors US Patent  US10851083 Publication Date 12/1/2020 
Target
Name:
Egl nine homolog 1 [181-417]
Synonyms:
C1orf12 EGLN1_HUMAN | Egl nine homolog 1 (aa 181-417)
Type:
Enzyme
Mol. Mass.:
26555.51
Organism:
Homo sapiens (Human)
Description:
aa 181-417
Residue:
237
  
Inhibitor
Name:
BDBM475550
Synonyms:
1-[5-(4-Methoxy-benzenesulfonyl)-6-trifluoromethyl-1H- US11618744, Example 162
Type:
Small organic molecule
Emp. Form.:
C19H13F3N4O5S
Mol. Mass.:
466.391
SMILES:
COc1ccc(cc1)S(=O)(=O)c1cc2nc([nH]c2cc1C(F)(F)F)-n1cc(cn1)C(O)=O
: