Target
Egl nine homolog 1 [181-417]
Ligand
BDBM475556
Substrate
Meas. Tech.
Enzyme Activity Assay
IC50
50.1±n/a nM
Citation
 Hocutt, FMLeonard, Jr., BEPeltier, HMPhuong, VKRabinowitz, MHRosen, MDTarantino, KTVenkatesan, HZhao, LX Benzoimidazoles as prolyl hydroxylase inhibitors US Patent  US10851083 Publication Date 12/1/2020 
Target
Name:
Egl nine homolog 1 [181-417]
Synonyms:
C1orf12 EGLN1_HUMAN | Egl nine homolog 1 (aa 181-417)
Type:
Enzyme
Mol. Mass.:
26555.51
Organism:
Homo sapiens (Human)
Description:
aa 181-417
Residue:
237
  
Inhibitor
Name:
BDBM475556
Synonyms:
1-[6-Chloro-5-(2,6-dichloro-benzylsulfanyl)-1H- US11618744, Example 168
Type:
Small organic molecule
Emp. Form.:
C18H11Cl3N4O2S
Mol. Mass.:
453.73
SMILES:
OC(=O)c1cnn(c1)-c1nc2cc(SCc3c(Cl)cccc3Cl)c(Cl)cc2[nH]1
: