Target
Egl nine homolog 1 [181-417]
Ligand
BDBM475560
Substrate
Meas. Tech.
Enzyme Activity Assay
IC50
31.6±n/a nM
Citation
 Hocutt, FMLeonard, Jr., BEPeltier, HMPhuong, VKRabinowitz, MHRosen, MDTarantino, KTVenkatesan, HZhao, LX Benzoimidazoles as prolyl hydroxylase inhibitors US Patent  US10851083 Publication Date 12/1/2020 
Target
Name:
Egl nine homolog 1 [181-417]
Synonyms:
C1orf12 EGLN1_HUMAN | Egl nine homolog 1 (aa 181-417)
Type:
Enzyme
Mol. Mass.:
26555.51
Organism:
Homo sapiens (Human)
Description:
aa 181-417
Residue:
237
  
Inhibitor
Name:
BDBM475560
Synonyms:
1-[6-Chloro-5-(2'-cyano-biphenyl-4-ylmethylsulfanyl)-1H- US11618744, Example 172
Type:
Small organic molecule
Emp. Form.:
C25H16ClN5O2S
Mol. Mass.:
485.945
SMILES:
OC(=O)c1cnn(c1)-c1nc2cc(SCc3ccc(cc3)-c3ccccc3C#N)c(Cl)cc2[nH]1
: