Target
Egl nine homolog 1 [181-417]
Ligand
BDBM475557
Substrate
Meas. Tech.
Enzyme Activity Assay
IC50
20.0±n/a nM
Citation
 Hocutt, FMLeonard, Jr., BEPeltier, HMPhuong, VKRabinowitz, MHRosen, MDTarantino, KTVenkatesan, HZhao, LX Benzoimidazoles as prolyl hydroxylase inhibitors US Patent  US10851083 Publication Date 12/1/2020 
Target
Name:
Egl nine homolog 1 [181-417]
Synonyms:
C1orf12 EGLN1_HUMAN | Egl nine homolog 1 (aa 181-417)
Type:
Enzyme
Mol. Mass.:
26555.51
Organism:
Homo sapiens (Human)
Description:
aa 181-417
Residue:
237
  
Inhibitor
Name:
BDBM475557
Synonyms:
1-[6-Chloro-5-(4-methyl-benzylsulfanyl)-1H- US10851083, Example 178 | US11618744, Example 178
Type:
Small organic molecule
Emp. Form.:
C19H15ClN4O4S
Mol. Mass.:
430.865
SMILES:
Cc1ccc(CS(=O)(=O)c2cc3nc([nH]c3cc2Cl)-n2cc(cn2)C(O)=O)cc1
: