Target
Tyrosine-protein kinase JAK1
Ligand
BDBM475703
Substrate
Meas. Tech.
Kinase Assay
EC50
46.0±n/a nM
Citation
 Greve, DRJepsen, THLarsen, MRitzen, A Bicyclic amines as novel JAK kinase inhibitors US Patent  US10851116 Publication Date 12/1/2020 
Target
Name:
Tyrosine-protein kinase JAK1
Synonyms:
JAK-1 JAK1A JAK1_HUMAN Janus kinase 1 (JAK1) | Janus kinase 1 JAK1
Type:
Protein
Mol. Mass.:
133293.73
Organism:
Homo sapiens (Human)
Description:
P23458
Residue:
1154
  
Inhibitor
Name:
BDBM475703
Synonyms:
2-[(4aR*,8aS*)-8a-ethyl-7-(7H-pyrrolo[2,3-d]pyrimidin-4-yl)-3,4,4a,5,6,8-hexahydro-1H-2,7-naphthyridin-2-yl]thiazole-4-carbonitrile | US10851116, Example 25
Type:
Small organic molecule
Emp. Form.:
C20H23N7S
Mol. Mass.:
393.509
SMILES:
CC[C@]12CN(CCC1CCN(C2)c1ncnc2[nH]ccc12)c1nc(cs1)C#N
: