Target
Tyrosine-protein kinase JAK3
Ligand
BDBM475704
Substrate
Meas. Tech.
Kinase Assay
EC50
243±n/a nM
Citation
 Greve, DRJepsen, THLarsen, MRitzen, A Bicyclic amines as novel JAK kinase inhibitors US Patent  US10851116 Publication Date 12/1/2020 
Target
Name:
Tyrosine-protein kinase JAK3
Synonyms:
JAK-3 JAK3_HUMAN Janus kinase 3 (JAK3) L-JAK | Leukocyte janus kinase
Type:
Protein
Mol. Mass.:
125111.08
Organism:
Homo sapiens (Human)
Description:
P52333
Residue:
1124
  
Inhibitor
Name:
BDBM475704
Synonyms:
4-[(3aS*,7aS*)-3a-methyl-2-methylsulfonyl-1,3,4,6,7,7a-hexahydropyrrolo[3,4-c]pyridin-5-yl]-7H-pyrrolo[2,3-d]pyrimidine | US10851116, Example 26
Type:
Small organic molecule
Emp. Form.:
C15H21N5O2S
Mol. Mass.:
335.425
SMILES:
C[C@]12CN(C[C@H]1CCN(C2)c1ncnc2[nH]ccc12)S(C)(=O)=O
: