Target
D(3) dopamine receptor
Ligand
BDBM476251
Substrate
Meas. Tech.
radioligand competition assay
Ki
1.42±0.14 nM
Citation
 Dutta, AK Neuroprotective agents for treatment of neurodegenerative diseases US Patent  US10874669 Publication Date 12/29/2020 
Target
Name:
D(3) dopamine receptor
Synonyms:
DOPAMINE D3 DRD3_HUMAN Dopamine D3 receptor (D3) Dopamine receptor Dopamine receptor D3
Type:
Mol. Mass.:
44243.43
Organism:
Homo sapiens (Human)
Description:
Residue:
400
  
Inhibitor
Name:
BDBM476251
Synonyms:
(R)-4-(5-((2-Amino-4,5,6,7-tetrahydrobenzo[d]thiazol-6-yl)(propyl)amino)pentyl)benzene-1,2-diol | US10874669, Compound (-) 34 (D-593)
Type:
Small organic molecule
Emp. Form.:
C21H31N3O2S
Mol. Mass.:
389.555
SMILES:
Nc1nc2CC[C@@H](CCCNCCCCCc3ccc(O)c(O)c3)Cc2s1
: