Target
Coagulation factor XII
Ligand
BDBM476352
Substrate
Meas. Tech.
Factor XIIa Assay
IC50
28.7±n/a nM
Citation
 Rao, AUMcKittrick, BALombardo, MHicks, JDBittner McCracken, AChu, HDSo, SOrth, PWu, ZLan, PDebenham, JSWhitehead, BRTaylor, JASun, ZKatipally, RRGable, JEDahlgren, MKBhat, SP Factor XIIa inhibitors US Patent  US10875851 Publication Date 12/29/2020 
Target
Name:
Coagulation factor XII
Synonyms:
Beta-factor XIIa part 1 Carboxylesterase 2 (intestine, liver) Coagulation factor XII (FXII) Coagulation factor XIIa light chain FA12_HUMAN Factor XIIa (fXIIa) Hageman factor
Type:
Enzyme
Mol. Mass.:
67810.07
Organism:
Homo sapiens (Human)
Description:
P00748
Residue:
615
  
Inhibitor
Name:
BDBM476352
Synonyms:
2-bromophenyl (3S)-4-(N,3- dicyclohexyl-D-alanyl)-3-[(thiophen- 2-ylmethyl)carbamoyl]piperazine-1- carboxylate | US10875851, Example 8
Type:
Small organic molecule
Emp. Form.:
C32H43BrN4O4S
Mol. Mass.:
659.677
SMILES:
Brc1ccccc1OC(=O)N1CCN([C@@H](C1)C(=O)NCc1cccs1)C(=O)[C@@H](CC1CCCCC1)NC1CCCCC1
: