Target
Bromodomain-containing protein 4
Ligand
BDBM474458
Substrate
Meas. Tech.
Binding Assay
IC50
28.0±n/a nM
Citation
 Bradner, JEQi, JTanaka, M Acetamide thienotriazolodiazepines and uses thereof US Patent  US10881668 Publication Date 1/5/2021 
Target
Name:
Bromodomain-containing protein 4
Synonyms:
BRD4 Bromodomain-containing protein 4 (BRD4) Protein HUNK1
Type:
Protein
Mol. Mass.:
152264.84
Organism:
Homo sapiens (Human)
Description:
O60885
Residue:
1362
  
Inhibitor
Name:
BDBM474458
Synonyms:
US10881668, Compound 502
Type:
Small organic molecule
Emp. Form.:
C22H24ClN5O2S
Mol. Mass.:
457.976
SMILES:
C[C@@H](O)CNC(=O)C[C@H]1N=C(c2c(C)c(C)sc2-n2c(C)nnc12)c1ccc(Cl)cc1
: