Target
Indoleamine 2,3-dioxygenase 1
Ligand
BDBM477142
Substrate
Meas. Tech.
Enzymatic Assay
IC50
>100000±n/a nM
Citation
 Palmer, BDChing, LMGamage, SA Inhibitors of tryptophan dioxygenases (IDO1 and TDO) and their use in therapy US Patent  US10888567 Publication Date 1/12/2021 
Target
Name:
Indoleamine 2,3-dioxygenase 1
Synonyms:
I23O1_HUMAN IDO-1 INDO Indoleamine 2,3-dioxygenase | Indoleamine-pyrrole 2,3-dioxygenase
Type:
Enzyme
Mol. Mass.:
45330.80
Organism:
Homo sapiens (Human)
Description:
P14902
Residue:
403
  
Inhibitor
Name:
BDBM477142
Synonyms:
US10888567, Compound 53
Type:
Small organic molecule
Emp. Form.:
C10H11N3O3
Mol. Mass.:
221.2126
SMILES:
CCOC(=O)c1cc2c(N)noc2nc1C
: