Target
Short transient receptor potential channel 6
Ligand
BDBM466592
Substrate
Meas. Tech.
High Throughput Screening Assay
IC50
27.0±n/a nM
Citation
 Bouyssou, TGottschling, DHeine, NSmith Keenan, LLLowe, MDRazavi, HSarko, CRSurprenant, STakahashi, HTurner, MRWu, X Inhibitors of TRPC6 US Patent  US10889568 Publication Date 1/12/2021 
Target
Name:
Short transient receptor potential channel 6
Synonyms:
TRP-6 TRPC6 Transient receptor protein 6
Type:
PROTEIN
Mol. Mass.:
106326.67
Organism:
Homo sapiens (Human)
Description:
ChEMBL_107640
Residue:
931
  
Inhibitor
Name:
BDBM466592
Synonyms:
US10800757, Compound 8 [7-(6-Amino-4-methoxy-pyridin-3-yl)- 4,7-diaza-spiro[2.5]oct-4-yl]-(4- methoxy-5-phenoxy-pyridin-2-yl)- methanone
Type:
Small organic molecule
Emp. Form.:
C25H27N5O4
Mol. Mass.:
461.513
SMILES:
COc1cc(ncc1Oc1ccccc1)C(=O)N1CCN(CC11CC1)c1cnc(N)cc1OC
: