Target
Short transient receptor potential channel 6
Ligand
BDBM466594
Substrate
Meas. Tech.
High Throughput Screening Assay
IC50
27.0±n/a nM
Citation
 Bouyssou, TGottschling, DHeine, NSmith Keenan, LLLowe, MDRazavi, HSarko, CRSurprenant, STakahashi, HTurner, MRWu, X Inhibitors of TRPC6 US Patent  US10889568 Publication Date 1/12/2021 
Target
Name:
Short transient receptor potential channel 6
Synonyms:
TRP-6 TRPC6 Transient receptor protein 6
Type:
PROTEIN
Mol. Mass.:
106326.67
Organism:
Homo sapiens (Human)
Description:
ChEMBL_107640
Residue:
931
  
Inhibitor
Name:
BDBM466594
Synonyms:
(6-Amino-4-methyl-3',4',5',6'- tetrahydro-2'H-[3,4']bipyridinyl-1'-yl)- (4-methoxy-5-phenoxy-pyridin-2-yl)- methanone US10889568, Compound 10
Type:
Small organic molecule
Emp. Form.:
C24H26N4O3
Mol. Mass.:
418.4882
SMILES:
COc1cc(ncc1Oc1ccccc1)C(=O)N1CCC(CC1)c1cnc(N)cc1C
: