Target
Short transient receptor potential channel 6
Ligand
BDBM466599
Substrate
Meas. Tech.
High Throughput Screening Assay
IC50
27.0±n/a nM
Citation
 Bouyssou, TGottschling, DHeine, NSmith Keenan, LLLowe, MDRazavi, HSarko, CRSurprenant, STakahashi, HTurner, MRWu, X Inhibitors of TRPC6 US Patent  US10889568 Publication Date 1/12/2021 
Target
Name:
Short transient receptor potential channel 6
Synonyms:
TRP-6 TRPC6 Transient receptor protein 6
Type:
PROTEIN
Mol. Mass.:
106326.67
Organism:
Homo sapiens (Human)
Description:
ChEMBL_107640
Residue:
931
  
Inhibitor
Name:
BDBM466599
Synonyms:
US10800757, Compound 15 [4-(6-Amino-pyridin-3-yl)-piperazin- 1-yl]-(4-methoxy-5-phenoxy-pyridin- 2-yl)-methanone
Type:
Small organic molecule
Emp. Form.:
C22H23N5O3
Mol. Mass.:
405.4497
SMILES:
COc1cc(ncc1Oc1ccccc1)C(=O)N1CCN(CC1)c1ccc(N)nc1
: