Target
Cathepsin D
Ligand
BDBM477899
Substrate
Meas. Tech.
In Vitro Enzymatic FRET Assay
IC50
673000±n/a nM
Citation
 Allen, JRAmegadzie, ABourbeau, MPChen, JJFrohn, MJHarrington, PELow, JDMa, VVNguyen, TTPickrell, AReeves, C Cyclopropyl fused thiazine derivatives as beta-secretase inhibitors and methods of use US Patent  US10889581 Publication Date 1/12/2021 
Target
Name:
Cathepsin D
Synonyms:
CATD_HUMAN CTSD Cathepsin D heavy chain Cathepsin D precursor
Type:
Enzyme
Mol. Mass.:
44551.72
Organism:
Homo sapiens (Human)
Description:
Human proCathepsin D (SwissProt accession number P07339) was expressed in Sf9 cells, purified, and autoactivated.
Residue:
412
  
Inhibitor
Name:
BDBM477899
Synonyms:
(1S,5S,6S)-5-(5-((5-chloropyridin-2-yl)ethynyl)-2-fluorophenyl)-1,5-bis(fluoromethyl)-2-thia-4-azabicyclo[4.1.0]hept-3-en-3-amine | US10889581, Example 102
Type:
Small organic molecule
Emp. Form.:
C20H15ClF3N3S
Mol. Mass.:
421.866
SMILES:
NC1=N[C@@](CF)([C@@H]2C[C@]2(CF)S1)c1cc(ccc1F)C#Cc1ccc(Cl)cn1
: