Target
Cyclin-dependent kinase 12
Ligand
BDBM479002
Substrate
Meas. Tech.
Protein kinase assay (Condition A: Thiol Containing Conditions)
IC50
50100±n/a nM
Citation
 Kanouni, TArnold, LDKaldor, SWMurphy, EATyhonas, J Inhibitors of cyclin-dependent kinases US Patent  US10894788 Publication Date 1/19/2021 
Target
Name:
Cyclin-dependent kinase 12
Synonyms:
2.7.11.22 CDC2-related protein kinase 7 CDK12_HUMAN CRKRS Cell division cycle 2-related protein kinase 7 Cyclin-dependent kinase 12 hCDK12
Type:
PROTEIN
Mol. Mass.:
164218.64
Organism:
Homo sapiens
Description:
ChEMBL_117739
Residue:
1490
  
Inhibitor
Name:
BDBM479002
Synonyms:
(R)-N-(4-(3-((4- morpholinopyrimidin-2- yl)amino)piperidine-1- carbonyl)phenyl)propionamide US11390618, Example 42
Type:
Small organic molecule
Emp. Form.:
C23H30N6O3
Mol. Mass.:
438.5227
SMILES:
CCC(=O)Nc1ccc(cc1)C(=O)N1CCC[C@H](C1)Nc1nccc(n1)N1CCOCC1
: