Target
Cyclin-dependent kinase 12
Ligand
BDBM479013
Substrate
Meas. Tech.
Protein kinase assay (Condition A: Thiol Containing Conditions)
IC50
550±n/a nM
Citation
 Kanouni, TArnold, LDKaldor, SWMurphy, EATyhonas, J Inhibitors of cyclin-dependent kinases US Patent  US10894788 Publication Date 1/19/2021 
Target
Name:
Cyclin-dependent kinase 12
Synonyms:
2.7.11.22 CDC2-related protein kinase 7 CDK12_HUMAN CRKRS Cell division cycle 2-related protein kinase 7 Cyclin-dependent kinase 12 hCDK12
Type:
PROTEIN
Mol. Mass.:
164218.64
Organism:
Homo sapiens
Description:
ChEMBL_117739
Residue:
1490
  
Inhibitor
Name:
BDBM479013
Synonyms:
(R)-N-(4-(3-((5-chloropyrazin-2- yl)amino)pyrrolidine-1- carbonyl)phenyl)acrylamide US11390618, Example 53
Type:
Small organic molecule
Emp. Form.:
C18H18ClN5O2
Mol. Mass.:
371.821
SMILES:
Clc1cnc(N[C@@H]2CCN(C2)C(=O)c2ccc(NC(=O)C=C)cc2)cn1
: