Target
Cyclin-dependent kinase 12
Ligand
BDBM479132
Substrate
Meas. Tech.
Protein kinase assay (Condition B: Thiol-free Conditions)
IC50
550±n/a nM
Citation
 Kanouni, TArnold, LDKaldor, SWMurphy, EATyhonas, J Inhibitors of cyclin-dependent kinases US Patent  US10894788 Publication Date 1/19/2021 
Target
Name:
Cyclin-dependent kinase 12
Synonyms:
2.7.11.22 CDC2-related protein kinase 7 CDK12_HUMAN CRKRS Cell division cycle 2-related protein kinase 7 Cyclin-dependent kinase 12 hCDK12
Type:
PROTEIN
Mol. Mass.:
164218.64
Organism:
Homo sapiens
Description:
ChEMBL_117739
Residue:
1490
  
Inhibitor
Name:
BDBM479132
Synonyms:
(R,E)-N-(4-(3-((5-chloro-4- methoxypyrimidin-2- yl)amino)pyrrolidine-1- carbonyl)phenyl)-4-(3,3- difluoropiperidin-1-yl)but-2-enamide US11390618, Example 173
Type:
Small organic molecule
Emp. Form.:
C25H29ClF2N6O3
Mol. Mass.:
534.986
SMILES:
COc1nc(N[C@@H]2CCN(C2)C(=O)c2ccc(NC(=O)\C=C\CN3CCCC(F)(F)C3)cc2)ncc1Cl
: