Target
Adenosine receptor A2a
Ligand
BDBM479541
Substrate
Meas. Tech.
Binding Affinity Assay
IC50
9.10±n/a nM
Citation
 Qi, CTsui, HZeng, QYang, ZZhang, X Pyrazine compounds and uses thereof US Patent  US10898481 Publication Date 1/26/2021 
Target
Name:
Adenosine receptor A2a
Synonyms:
A2A adenosine receptor (hA2A) ADENOSINE A2 ADORA2 Adenosine A2A receptor (A2AAR)
Type:
G Protein-Coupled Receptor (GPCR)
Mol. Mass.:
44716.46
Organism:
Homo sapiens (Human)
Description:
P29274
Residue:
412
  
Inhibitor
Name:
BDBM479541
Synonyms:
3-amino-N-cyclobutyl-6-(3- methylimidazo[1,2-a]pyridin-6-yl)-5- (oxazol-2- yl)pyrazine-2-carboxamide US11571420, Compound 218
Type:
Small organic molecule
Emp. Form.:
C20H19N7O2
Mol. Mass.:
389.4106
SMILES:
Cc1cnc2ccc(cn12)-c1nc(C(=O)NC2CCC2)c(N)nc1-c1ncco1
: