Target
Transient receptor potential cation channel subfamily A member 1
Ligand
BDBM481796
Substrate
Meas. Tech.
FLIPR Assay
IC50
7.00±n/a nM
Citation
 Chen, HShore, DVillemure, EVolgraf, MHu, BLu, ACridland, AWard, SBeaumier, FDery, MLarouche-Gauthier, R Oxadiazolones as transient receptor potential channel inhibitors US Patent  US10913742 Publication Date 2/9/2021 
Target
Name:
Transient receptor potential cation channel subfamily A member 1
Synonyms:
ANKTM1 TRPA1 Transformation-sensitive protein p120 | Transient receptor potential cation channel subfamily A member 1 (TRPA1)
Type:
Protein
Mol. Mass.:
127514.20
Organism:
Homo sapiens (Human)
Description:
O75762
Residue:
1119
  
Inhibitor
Name:
BDBM481796
Synonyms:
5-[(7-methyl-6-oxo-purin-1- yl)methyl]-3-[(2S)-2-fluoro- 2-(2-naphthyl)ethyl]-1,3,4- oxadiazol-2-one | US10913742, Example 38
Type:
Small organic molecule
Emp. Form.:
C21H17FN6O3
Mol. Mass.:
420.3965
SMILES:
Cn1cnc2ncn(Cc3nn(C[C@H](F)c4ccc5ccccc5c4)c(=O)o3)c(=O)c12
: