Target
Transient receptor potential cation channel subfamily A member 1
Ligand
BDBM481798
Substrate
Meas. Tech.
FLIPR Assay
IC50
18.0±n/a nM
Citation
 Chen, HShore, DVillemure, EVolgraf, MHu, BLu, ACridland, AWard, SBeaumier, FDery, MLarouche-Gauthier, R Oxadiazolones as transient receptor potential channel inhibitors US Patent  US10913742 Publication Date 2/9/2021 
Target
Name:
Transient receptor potential cation channel subfamily A member 1
Synonyms:
ANKTM1 TRPA1 Transformation-sensitive protein p120 | Transient receptor potential cation channel subfamily A member 1 (TRPA1)
Type:
Protein
Mol. Mass.:
127514.20
Organism:
Homo sapiens (Human)
Description:
O75762
Residue:
1119
  
Inhibitor
Name:
BDBM481798
Synonyms:
5-((8-chloro-5-methyl-4- oxopyrido[3,4-d]pyrimidin- 3(4H)-yl)methyl)-3-(4- chlorophenethyl)-1,3,4- oxadiazol-2(3H)-one | US10913742, Example 40
Type:
Small organic molecule
Emp. Form.:
C19H15Cl2N5O3
Mol. Mass.:
432.26
SMILES:
Cc1cnc(Cl)c2ncn(Cc3nn(CCc4ccc(Cl)cc4)c(=O)o3)c(=O)c12
: