Target
Transient receptor potential cation channel subfamily A member 1
Ligand
BDBM481822
Substrate
Meas. Tech.
FLIPR Assay
IC50
21.1±n/a nM
Citation
 Chen, HShore, DVillemure, EVolgraf, MHu, BLu, ACridland, AWard, SBeaumier, FDery, MLarouche-Gauthier, R Oxadiazolones as transient receptor potential channel inhibitors US Patent  US10913742 Publication Date 2/9/2021 
Target
Name:
Transient receptor potential cation channel subfamily A member 1
Synonyms:
ANKTM1 TRPA1 Transformation-sensitive protein p120 | Transient receptor potential cation channel subfamily A member 1 (TRPA1)
Type:
Protein
Mol. Mass.:
127514.20
Organism:
Homo sapiens (Human)
Description:
O75762
Residue:
1119
  
Inhibitor
Name:
BDBM481822
Synonyms:
US10913742, Example 65 | trans-2-[[4-[3-(4- chlorophenyl)cyclobutyl]-5- oxo-1,3,4-oxadiazol-2- yl]methyl]pyrido[1,2- a]pyrazine-1,6-dione
Type:
Small organic molecule
Emp. Form.:
C21H17ClN4O4
Mol. Mass.:
424.837
SMILES:
Clc1ccc(cc1)[C@H]1C[C@@H](C1)n1nc(Cn2ccn3c(cccc3=O)c2=O)oc1=O
: