Target
Transient receptor potential cation channel subfamily A member 1
Ligand
BDBM481839
Substrate
Meas. Tech.
FLIPR Assay
IC50
15.2±n/a nM
Citation
 Chen, HShore, DVillemure, EVolgraf, MHu, BLu, ACridland, AWard, SBeaumier, FDery, MLarouche-Gauthier, R Oxadiazolones as transient receptor potential channel inhibitors US Patent  US10913742 Publication Date 2/9/2021 
Target
Name:
Transient receptor potential cation channel subfamily A member 1
Synonyms:
ANKTM1 TRPA1 Transformation-sensitive protein p120 | Transient receptor potential cation channel subfamily A member 1 (TRPA1)
Type:
Protein
Mol. Mass.:
127514.20
Organism:
Homo sapiens (Human)
Description:
O75762
Residue:
1119
  
Inhibitor
Name:
BDBM481839
Synonyms:
3-((4-((trans)-3-(4- chlorophenyl)cyclobutyl)-5- oxo-4,5-dihydro-1,3,4- oxadiazol-2-yl)methyl)-5- methylpyrido[3,2-d]pyrimidine- 4,6(3H,5H)-dione | US10913742, Example 83
Type:
Small organic molecule
Emp. Form.:
C21H18ClN5O4
Mol. Mass.:
439.852
SMILES:
Cn1c2c(ccc1=O)ncn(Cc1nn([C@H]3C[C@@H](C3)c3ccc(Cl)cc3)c(=O)o1)c2=O
: