Target
Transient receptor potential cation channel subfamily A member 1
Ligand
BDBM481841
Substrate
Meas. Tech.
FLIPR Assay
IC50
6.34±n/a nM
Citation
 Chen, HShore, DVillemure, EVolgraf, MHu, BLu, ACridland, AWard, SBeaumier, FDery, MLarouche-Gauthier, R Oxadiazolones as transient receptor potential channel inhibitors US Patent  US10913742 Publication Date 2/9/2021 
Target
Name:
Transient receptor potential cation channel subfamily A member 1
Synonyms:
ANKTM1 TRPA1 Transformation-sensitive protein p120 | Transient receptor potential cation channel subfamily A member 1 (TRPA1)
Type:
Protein
Mol. Mass.:
127514.20
Organism:
Homo sapiens (Human)
Description:
O75762
Residue:
1119
  
Inhibitor
Name:
BDBM481841
Synonyms:
3-(3-(3- chlorophenoxy)propyl)-5- ((5-methyl-4-oxopyrido[2,3- d]pyrimidin-3(4H)-yl)methyl)- 1,3,4-oxadiazol-2(3H)-one | US10913742, Example 85
Type:
Small organic molecule
Emp. Form.:
C20H18ClN5O4
Mol. Mass.:
427.841
SMILES:
Cc1ccnc2ncn(Cc3nn(CCCOc4cccc(Cl)c4)c(=O)o3)c(=O)c12
: