Target
Transient receptor potential cation channel subfamily A member 1
Ligand
BDBM481842
Substrate
Meas. Tech.
FLIPR Assay
IC50
22.6±n/a nM
Citation
 Chen, HShore, DVillemure, EVolgraf, MHu, BLu, ACridland, AWard, SBeaumier, FDery, MLarouche-Gauthier, R Oxadiazolones as transient receptor potential channel inhibitors US Patent  US10913742 Publication Date 2/9/2021 
Target
Name:
Transient receptor potential cation channel subfamily A member 1
Synonyms:
ANKTM1 TRPA1 Transformation-sensitive protein p120 | Transient receptor potential cation channel subfamily A member 1 (TRPA1)
Type:
Protein
Mol. Mass.:
127514.20
Organism:
Homo sapiens (Human)
Description:
O75762
Residue:
1119
  
Inhibitor
Name:
BDBM481842
Synonyms:
1-([4-[3-(3- chlorophenoxy)propyl]-5- oxo-4,5-dihydro-1,3,4- oxadiazol-2-yl]methyl)-7- methyl-6,7-dihydro-1H- purin-6-one | US10913742, Example 86
Type:
Small organic molecule
Emp. Form.:
C18H17ClN6O4
Mol. Mass.:
416.818
SMILES:
Cn1cnc2ncn(Cc3nn(CCCOc4cccc(Cl)c4)c(=O)o3)c(=O)c12
: