Target
Transient receptor potential cation channel subfamily A member 1
Ligand
BDBM481847
Substrate
Meas. Tech.
FLIPR Assay
IC50
36.2±n/a nM
Citation
 Chen, HShore, DVillemure, EVolgraf, MHu, BLu, ACridland, AWard, SBeaumier, FDery, MLarouche-Gauthier, R Oxadiazolones as transient receptor potential channel inhibitors US Patent  US10913742 Publication Date 2/9/2021 
Target
Name:
Transient receptor potential cation channel subfamily A member 1
Synonyms:
ANKTM1 TRPA1 Transformation-sensitive protein p120 | Transient receptor potential cation channel subfamily A member 1 (TRPA1)
Type:
Protein
Mol. Mass.:
127514.20
Organism:
Homo sapiens (Human)
Description:
O75762
Residue:
1119
  
Inhibitor
Name:
BDBM481847
Synonyms:
5-[[4-[3-(4- chlorophenyl)cyclobutyl]-5- oxo-1,3,4-oxadiazol-2- yl]methyl]-3-methyl- isoxazolo[5,4-d]pyrimidin- 4-one | US10913742, Example 91
Type:
Small organic molecule
Emp. Form.:
C19H16ClN5O4
Mol. Mass.:
413.814
SMILES:
Cc1noc2ncn(Cc3nn([C@H]4C[C@@H](C4)c4ccc(Cl)cc4)c(=O)o3)c(=O)c12
: