Target
Transient receptor potential cation channel subfamily A member 1
Ligand
BDBM481854
Substrate
Meas. Tech.
FLIPR Assay
IC50
16.2±n/a nM
Citation
 Chen, HShore, DVillemure, EVolgraf, MHu, BLu, ACridland, AWard, SBeaumier, FDery, MLarouche-Gauthier, R Oxadiazolones as transient receptor potential channel inhibitors US Patent  US10913742 Publication Date 2/9/2021 
Target
Name:
Transient receptor potential cation channel subfamily A member 1
Synonyms:
ANKTM1 TRPA1 Transformation-sensitive protein p120 | Transient receptor potential cation channel subfamily A member 1 (TRPA1)
Type:
Protein
Mol. Mass.:
127514.20
Organism:
Homo sapiens (Human)
Description:
O75762
Residue:
1119
  
Inhibitor
Name:
BDBM481854
Synonyms:
US10913742, Example 98 | trans-3-[3-(4- chlorophenyl)cyclobutyl]-5- [(4-oxopyrido[2,3- d]pyrimidin-3-yl)methyl]- 1,3,4-oxadiazol-2-one
Type:
Small organic molecule
Emp. Form.:
C20H16ClN5O3
Mol. Mass.:
409.826
SMILES:
Clc1ccc(cc1)[C@H]1C[C@@H](C1)n1nc(Cn2cnc3ncccc3c2=O)oc1=O
: