Target
Transient receptor potential cation channel subfamily A member 1
Ligand
BDBM481857
Substrate
Meas. Tech.
FLIPR Assay
IC50
36.1±n/a nM
Citation
 Chen, HShore, DVillemure, EVolgraf, MHu, BLu, ACridland, AWard, SBeaumier, FDery, MLarouche-Gauthier, R Oxadiazolones as transient receptor potential channel inhibitors US Patent  US10913742 Publication Date 2/9/2021 
Target
Name:
Transient receptor potential cation channel subfamily A member 1
Synonyms:
ANKTM1 TRPA1 Transformation-sensitive protein p120 | Transient receptor potential cation channel subfamily A member 1 (TRPA1)
Type:
Protein
Mol. Mass.:
127514.20
Organism:
Homo sapiens (Human)
Description:
O75762
Residue:
1119
  
Inhibitor
Name:
BDBM481857
Synonyms:
5-[(7-methyl-6-oxo-purin-1- yl)methyl]-3-[rac-(1R,3R)-3- (3-chlorophenyl)cyclopentyl]- 1,3,4-oxadiazol-2-one | US10913742, Example 101
Type:
Small organic molecule
Emp. Form.:
C20H19ClN6O3
Mol. Mass.:
426.856
SMILES:
Cn1cnc2ncn(Cc3nn([C@@H]4CC[C@H](C4)c4cccc(Cl)c4)c(=O)o3)c(=O)c12
: